{"text_format":"1","workbook":"xlsx","n_sheets":15,"sheets":["App. Instructions","Dev Input Sheet","Application","TS-Reqrmnts","TS Review HM 6-21TS","Pre-Apprvl HM 6-21","Form HM 6-24","HM 6-24 Addl Sheet-1","HM 6-24 Addl Sheet-2","HM 6-24 Addl Sheet-3","HM 6-24 Addl Sheet-4","Release Apprvl HM 6-20","Standards-Design","RR Codes HM 6-22","RR Codes HM 6-23"],"not_rendered":{"charts":0,"images":67,"macros":1,"external_links":1,"defined_names":16,"comments":0,"pivot_tables":0},"unopened":[],"bounds":{"document_bytes":16777216,"sheet_cells":100000,"rows_first":2000,"rows_last":500,"rows_between":2000,"halvings":0,"cell_chars":16384,"cell_head_chars":4096},"cells_cut":0,"cells_raw":0,"read":"whole","date_system":"1900"}

{"sheet":"App. Instructions","index":0,"n_rows":24,"n_cols":2,"rows_kept":24,"cut":false,"hidden":false,"merged":[[8,1,8,9],[0,0,0,9],[4,1,4,9],[5,1,5,9],[6,1,6,9],[7,1,7,9],[15,1,15,9],[23,0,23,9],[9,1,9,9],[10,1,10,9],[11,1,11,9],[12,1,12,9],[13,1,13,9],[14,1,14,9]]}
["Department of Housing / Connecticut Housing Finance Authority\nSSHP Priority / Critical  Needs Funding\nApplication Instructions"]
[]
["Application:"]
[null,"- Owner should complete all areas highlighted in yellow"]
[null,"Section II - Development Reserves:"]
[null,"- If CHFA has not already received the referenced balance sheet, a copy should be included with application package."]
{"$rows_left_out":19}
{"sheet":"Dev Input Sheet","index":1,"n_rows":22,"n_cols":1,"rows_kept":22,"cut":false,"hidden":false,"merged":[[0,0,0,1],[3,0,3,1]]}
["Development Input Sheet"]
[]
[]
["In order to make your experience with this workbook \"user-friendly\" we have created this Development Input Sheet.  The information which is inserted below will automatically flow to the applicable areas within each worksheet."]
[]
["Development Name:"]
{"$rows_left_out":17}
{"sheet":"Application","index":2,"n_rows":65,"n_cols":15,"rows_kept":65,"cut":false,"hidden":false,"merged":[[25,1,25,10],[0,0,0,15],[2,5,2,8],[2,12,2,14],[4,5,4,8],[4,12,4,14],[6,5,6,8],[6,12,6,14],[8,5,8,8],[10,5,10,8],[12,5,12,8],[12,12,12,14],[16,8,16,9],[26,1,26,11],[29,1,29,3],[30,1,30,11],[30,12,30,13],[31,1,31,11],[31,12,31,13],[32,1,32,11],[32,12,32,13],[33,1,33,11],[33,12,33,13],[34,1,34,11],[34,12,34,13],[35,1,35,11],[35,12,35,13],[36,1,36,11],[36,12,36,13],[37,1,37,11],[37,12,37,13],[46,14,46,15],[47,12,47,13],[47,14,47,15],[38,1,38,11],[38,12,38,13],[39,1,39,11],[39,12,39,13],[40,1,40,11],[40,12,40,13],[41,1,41,11],[41,12,41,13],[42,12,42,13],[46,12,46,13],[48,9,48,10],[48,12,48,13],[48,14,48,15],[49,12,49,13],[49,14,49,15],[61,2,61,8],[62,2,62,8],[51,8,51,9],[63,2,63,8],[64,14,64,15],[52,8,52,9],[56,1,56,14],[57,0,57,8],[57,12,57,13],[58,12,58,13],[60,2,60,8]]}
["Department of Housing / Connecticut Housing Finance Authority\nSSHP Priority Needs Funding Application"]
["I. DEVELOPMENT INFORMATION:"]
[null,null,null,null,"DEVELOPMENT NAME:",{"$f":"IF(ISBLANK('Dev Input Sheet'!B6),\"\",'Dev Input Sheet'!B6)","v":""},null,null,null,null,null,"CHFA DEVELOPMENT #:",{"$f":"IF(ISBLANK('Dev Input Sheet'!B10),\"\",'Dev Input Sheet'!B10)","v":""}]
[]
[null,null,null,null,"OWNER/AGENT NAME:",{"$f":"IF(ISBLANK('Dev Input Sheet'!B14),\"\",'Dev Input Sheet'!B14)","v":""},null,null,null,null,null,"CHFA ASSET MANAGER:",{"$f":"IF(ISBLANK('Dev Input Sheet'!B12),\"\",'Dev Input Sheet'!B12)","v":""}]
[]
{"$rows_left_out":60}
{"sheet":"TS-Reqrmnts","index":3,"n_rows":19,"n_cols":2,"rows_kept":19,"cut":false,"hidden":false,"merged":[[16,1,16,10],[18,1,18,10],[1,1,1,10],[3,0,3,10],[14,1,14,10],[6,1,6,10],[12,1,12,10],[4,1,4,2]]}
[]
[null,"TECHNICAL SERVICES REQUIREMENTS"]
[]
["Please be sure to read and refer to the current Construction Guidelines: Technical Services/Asset Management (TSAM) and Capital Improvement Guide (CIG) (see link below to Guidelines).  Any purchase or contracts in Classification B.2  and/or Classification C of the Guidelines will require pre-approval.  To avoid delays, please submit all applicable items, such as those listed below."]
[null,"Guidelines link"]
[]
{"$rows_left_out":14}
{"sheet":"TS Review HM 6-21TS","index":4,"n_rows":67,"n_cols":46,"rows_kept":67,"cut":false,"hidden":false,"merged":[[47,1,47,45],[15,22,15,28],[12,35,12,45],[14,35,14,45],[8,1,8,7],[10,1,10,7],[12,1,12,7],[14,1,14,7],[41,13,41,36],[42,13,42,36],[43,13,43,36],[41,5,41,8],[42,5,42,8],[43,5,43,8],[9,22,9,28],[28,13,28,43],[4,2,4,45],[5,2,5,7],[36,13,36,30],[37,5,37,8],[37,13,37,30],[20,27,20,45],[11,22,11,28],[13,22,13,28],[18,10,18,19],[20,14,20,23],[14,27,14,34],[14,9,14,26],[27,13,27,43],[27,5,27,8],[8,35,8,45],[10,35,10,45],[66,29,66,36],[50,5,50,23],[49,29,49,45],[50,29,50,45],[66,10,66,25],[61,19,61,45],[58,41,58,45],[58,22,58,26],[57,12,57,15],[49,4,49,23],[51,6,51,23],[51,29,51,45],[38,5,38,8],[38,13,38,30],[12,27,12,34],[10,9,10,26],[8,9,8,26],[8,27,8,34],[10,27,10,34],[12,9,12,26],[29,13,29,43],[30,13,30,43],[31,13,31,43],[36,5,36,8],[28,5,28,8],[29,5,29,8],[30,5,30,8],[31,5,31,8]]}
[null,"CHFA TECHNICAL SERVICES",null,null,null,null,null,null,null,null,null,null,null,null,null,null,null,null,null,null,null,null,null,null,null,null,null,null,null,null,null,null,null,null,null,null,null,null,null,null,null,null,null,null,null,"Connecticut Housing Finance Authority"]
[null,"REVIEW & APPROVAL",null,null,null,null,null,null,null,null,null,null,null,null,null,null,null,null,null,null,null,null,null,null,null,null,null,null,null,null,null,null,null,null,null,null,null,null,null,null,null,null,null,null,null,"Asset Management - Multifamily Housing"]
[]
[null,"CHFA Form HM 6-21TS (01/2019)"]
[null,null,"The purpose of this form is to obtain approval from CHFA Technical Services PRIOR to bid solicitation on all Capital Improvement Projects (CIP) outlined in the current Construction Guidelines: Technical Services/Asset Management (TSAM) and Capital Improvement Guide (CIG) under Classification B.2 & Classification C (see link below to Guidelines)."]
[null,null,"Guidelines link"]
{"$rows_left_out":62}
{"sheet":"Pre-Apprvl HM 6-21","index":5,"n_rows":78,"n_cols":46,"rows_kept":78,"cut":false,"hidden":false,"merged":[[75,14,75,31],[75,32,75,34],[75,35,75,43],[77,14,77,31],[77,32,77,34],[77,35,77,43],[12,22,12,28],[13,1,13,8],[13,9,13,26],[13,27,13,34],[13,35,13,45],[10,22,10,28],[11,1,11,8],[11,9,11,26],[11,27,11,34],[11,35,11,45],[4,2,4,44],[9,1,9,8],[9,9,9,26],[9,27,9,34],[9,35,9,45],[5,2,5,45],[14,22,14,28],[15,1,15,8],[15,9,15,26],[15,27,15,34],[15,35,15,45],[16,22,16,28],[19,10,19,19],[23,8,23,36],[24,8,24,14],[24,21,24,26],[24,32,24,36],[25,8,25,14],[25,26,25,32],[37,5,37,8],[37,14,37,33],[32,7,33,45],[34,5,34,8],[34,14,34,33],[35,5,35,8],[35,14,35,33],[36,5,36,8],[36,14,36,33],[29,1,29,45],[44,5,44,8],[44,14,44,38],[39,7,40,45],[41,5,41,8],[41,14,41,38],[42,5,42,8],[42,14,42,38],[43,5,43,8],[43,14,43,38],[46,7,47,45],[46,2,46,6],[57,1,57,45],[59,21,59,25],[59,30,59,43],[50,1,50,45],[52,4,52,23],[52,27,52,45],[53,5,53,23],[53,27,53,45],[51,1,51,45],[63,26,63,33],[63,34,63,41],[65,18,65,43],[70,32,70,34],[70,35,70,43],[66,1,66,11],[66,15,66,25],[66,29,66,34],[68,1,68,45],[70,14,70,31]]}
[null,"ESCROW RELEASE",null,null,null,null,null,null,null,null,null,null,null,null,null,null,null,null,null,null,null,null,null,null,null,null,null,null,null,null,null,null,null,null,null,null,null,null,null,null,null,null,null,null,null,"Connecticut Housing Finance Authority"]
[null,"PRE-APPROVAL",null,null,null,null,null,null,null,null,null,null,null,null,null,null,null,null,null,null,null,null,null,null,null,null,null,null,null,null,null,null,null,null,null,null,null,null,null,null,null,null,null,null,null,"Asset Management - Multifamily Housing"]
[]
[null,"CHFA Form HM 6-21  (Rev. 12/2023)"]
[null,null,"The purpose of this form is to obtain pre-approval from Asset Management in order to commence work or purchase items intended to be reimbursed from a CHFA held escrow account.  All purchases or contracts in excess of $10,000 require pre-approval.  Any purchases/contracts which cannot be categorized using the descriptive codes (as outlined in CHFA Form HM 6-22), regardless of cost, require pre-approval.  Any purchase or contracts in Classification B.2  and/or Classification C of the current Construction Guidelines: Technical Services/Asset Management (TSAM) and Capital Improvement Guide (CIG) require pre-approval (see link below to Guidelines)."]
[null,null,"Guidelines Link"]
{"$rows_left_out":73}
{"sheet":"Form HM 6-24","index":6,"n_rows":49,"n_cols":23,"rows_kept":49,"cut":false,"hidden":true,"merged":[[36,17,36,21],[35,17,35,21],[34,17,34,21],[8,2,8,4],[8,6,8,7],[8,8,8,9],[2,11,2,12],[48,15,48,16],[44,15,44,16],[45,15,45,16],[46,15,46,16],[47,15,47,16],[2,2,2,4],[3,2,3,4],[4,2,4,4],[5,2,5,4],[6,2,6,4],[44,1,44,2],[45,1,45,2],[29,3,29,9],[30,3,30,9],[31,3,31,9],[32,3,32,9],[46,1,46,2],[47,1,47,2],[48,1,48,2],[7,2,7,4],[11,3,11,9],[23,3,23,9],[24,3,24,9],[25,3,25,9],[38,5,38,7],[41,5,41,7],[33,0,37,14],[29,12,29,13],[30,12,30,13],[30,10,30,11],[31,12,31,13],[12,3,12,9],[13,3,13,9],[14,3,14,9],[15,3,15,9],[16,3,16,9],[17,3,17,9],[27,12,27,13],[23,10,23,11],[25,10,25,11],[26,10,26,11],[16,12,16,13],[17,12,17,13],[18,12,18,13],[28,12,28,13],[16,10,16,11],[26,3,26,9],[27,3,27,9],[24,12,24,13],[22,12,22,13],[23,12,23,13],[28,3,28,9],[18,3,18,9],[19,3,19,9],[20,3,20,9],[25,12,25,13],[26,12,26,13],[24,10,24,11],[19,12,19,13],[20,12,20,13],[21,12,21,13],[3,0,3,1],[13,18,13,21],[14,18,14,21],[15,18,15,21],[6,6,6,7],[6,8,6,9],[28,10,28,11],[17,10,17,11],[18,10,18,11],[14,10,14,11],[20,10,20,11],[21,10,21,11],[22,10,22,11],[12,10,12,11],[23,18,23,21],[24,18,24,21],[19,10,19,11],[11,10,11,11],[11,12,11,13],[12,12,12,13],[13,12,13,13],[14,12,14,13],[15,12,15,13],[15,10,15,11],[48,20,48,22],[41,18,41,19],[41,21,41,22],[28,18,28,21],[11,18,11,21],[25,18,25,21],[26,18,26,21],[22,3,22,9],[3,6,4,7],[3,8,4,9],[4,10,5,10],[4,11,5,11],[12,18,12,21],[2,15,3,15],[2,17,3,18],[2,6,2,7],[7,6,7,7],[7,8,7,9],[46,20,46,22],[29,18,29,21],[43,0,43,21],[30,18,30,21],[31,18,31,21],[31,10,31,11],[2,0,2,1],[5,6,5,7],[5,8,5,9],[13,10,13,11],[2,8,2,9],[38,18,38,19],[38,21,38,22],[32,17,32,21],[33,17,33,21],[37,17,37,21],[21,3,21,9],[27,10,27,11],[32,10,32,15],[27,18,27,21],[29,10,29,11],[22,18,22,21],[16,18,16,21],[17,18,17,21],[18,18,18,21],[19,18,19,21],[20,18,20,21],[21,18,21,21],[4,0,4,1],[10,0,10,22]]}
[null,null,null,null,null,null,"REQUEST TO RELEASE ESCROW FUNDS",null,null,null,null,null,null,null,null,null,null,null,null,"CHFA Form HM 6-24"]
[null,null,null,null,null,null,null,null,null,null,null,null,null,null,null,null,null,null,null,null,"(Rev. 01/2019)"]
["Development Name:",null,{"$f":"IF(ISBLANK('Dev Input Sheet'!B6),\"\",'Dev Input Sheet'!B6)","v":""},null,null,null,null,null,null,null,"CHFA Loan #:",{"$f":"IF(ISBLANK('Dev Input Sheet'!B10),\"\",'Dev Input Sheet'!B10)","v":""}]
["Owner:",null,{"$f":"IF(ISBLANK('Dev Input Sheet'!B14),\"\",'Dev Input Sheet'!B14)","v":""}]
["Project Contact Name:",null,{"$f":"IF(ISBLANK('Dev Input Sheet'!B18),\"\",'Dev Input Sheet'!B18)","v":""},null,null,null,null,null,null,null,null,null,"As the Owner/Agent for the referenced property, I do hereby CERTIFY that the "]
[null,"       Mgmt.  Co:",{"$f":"IF(ISBLANK('Dev Input Sheet'!B16),\"\",'Dev Input Sheet'!B16)","v":""},null,null,null,null,null,null,null,null,null,"Capital Repairs/Replacements noted were not paid from Insurance Proceeds."]
{"$rows_left_out":44}
{"sheet":"HM 6-24 Addl Sheet-1","index":7,"n_rows":43,"n_cols":17,"rows_kept":43,"cut":false,"hidden":true,"merged":[[18,11,18,14],[19,11,19,14],[32,11,32,14],[40,11,40,14],[33,11,33,14],[34,11,34,14],[35,11,35,14],[36,11,36,14],[37,11,37,14],[2,9,2,10],[39,11,39,14],[7,11,7,14],[8,11,8,14],[2,11,2,16],[3,11,3,16],[4,11,4,16],[10,11,10,14],[11,11,11,14],[12,11,12,14],[9,11,9,14],[3,9,3,10],[6,0,6,16],[5,8,5,9],[5,10,5,14],[5,0,5,1],[2,6,2,8],[3,6,3,8],[4,0,4,1],[4,2,4,3],[2,0,2,1],[3,0,3,1],[2,2,2,3],[3,2,3,3],[4,6,4,8],[4,9,4,10],[14,11,14,14],[15,11,15,14],[16,11,16,14],[17,11,17,14],[13,11,13,14],[40,6,40,8],[43,0,43,5],[42,0,42,5],[38,11,38,14],[20,11,20,14],[21,11,21,14],[28,11,28,14],[29,11,29,14],[30,11,30,14],[31,11,31,14],[22,11,22,14],[23,11,23,14],[24,11,24,14],[25,11,25,14],[26,11,26,14],[27,11,27,14]]}
["CONNECTICUT HOUSING FINANCE AUTHORITY",null,null,null,null,{"$f":"+'Form HM 6-24'!G1","v":"REQUEST TO RELEASE ESCROW FUNDS"},null,null,null,null,null,null,null,null,null,null,"CHFA Form HM 6-24-addl sheet(s)"]
[null,null,null,null,null,null,null,null,null,null,null,null,null,null,null,null," (Rev. 01/2019)"]
["Development Name:",null,{"$f":"IF(ISBLANK('Dev Input Sheet'!B6),\"\",'Dev Input Sheet'!B6)","v":""},null,null,"Mgmt.  Co.",{"$f":"IF(ISBLANK('Dev Input Sheet'!B16),\"\",'Dev Input Sheet'!B16)","v":""},null,null," CHFA Loan #:",null,{"$f":"IF(ISBLANK('Dev Input Sheet'!B10),\"\",'Dev Input Sheet'!B10)","v":""}]
["Owner:",null,{"$f":"IF(ISBLANK('Dev Input Sheet'!B14),\"\",'Dev Input Sheet'!B14)","v":""},null,null,"# of Units:",{"$f":"IF(ISBLANK('Dev Input Sheet'!B8),\"\",'Dev Input Sheet'!B8)","v":""},null,null,"CHFA Asset Manager:",null,{"$f":"IF(ISBLANK('Dev Input Sheet'!B12),\"\",'Dev Input Sheet'!B12)","v":""}]
["Project Contact Name:",null,{"$f":"IF(ISBLANK('Dev Input Sheet'!B18),\"\",'Dev Input Sheet'!B18)","v":""},null,null," Contact Email:",{"$f":"IF(ISBLANK('Dev Input Sheet'!B20),\"\",'Dev Input Sheet'!B20)","v":""},null,null,"Contact Phone:",null,{"$f":"IF(ISBLANK('Dev Input Sheet'!B22),\"\",'Dev Input Sheet'!B22)","v":""}]
[]
{"$rows_left_out":38}
{"sheet":"HM 6-24 Addl Sheet-2","index":8,"n_rows":43,"n_cols":17,"rows_kept":43,"cut":false,"hidden":true,"merged":[[42,0,42,5],[43,0,43,5],[36,11,36,14],[37,11,37,14],[38,11,38,14],[39,11,39,14],[40,6,40,8],[40,11,40,14],[35,11,35,14],[24,11,24,14],[25,11,25,14],[26,11,26,14],[27,11,27,14],[28,11,28,14],[29,11,29,14],[30,11,30,14],[31,11,31,14],[32,11,32,14],[33,11,33,14],[34,11,34,14],[23,11,23,14],[12,11,12,14],[13,11,13,14],[14,11,14,14],[15,11,15,14],[16,11,16,14],[17,11,17,14],[18,11,18,14],[19,11,19,14],[20,11,20,14],[21,11,21,14],[22,11,22,14],[11,11,11,14],[4,0,4,1],[4,2,4,3],[4,6,4,8],[4,9,4,10],[4,11,4,16],[5,0,5,1],[5,8,5,9],[5,10,5,14],[6,0,6,16],[7,11,7,14],[8,11,8,14],[9,11,9,14],[10,11,10,14],[2,0,2,1],[2,2,2,3],[2,6,2,8],[2,9,2,10],[2,11,2,16],[3,0,3,1],[3,2,3,3],[3,6,3,8],[3,9,3,10],[3,11,3,16]]}
["CONNECTICUT HOUSING FINANCE AUTHORITY",null,null,null,null,{"$f":"+'Form HM 6-24'!G1","v":"REQUEST TO RELEASE ESCROW FUNDS"},null,null,null,null,null,null,null,null,null,null,"CHFA Form HM 6-24-addl sheet(s)"]
[null,null,null,null,null,null,null,null,null,null,null,null,null,null,null,null," (Rev. 01/2019)"]
["Development Name:",null,{"$f":"IF(ISBLANK('Dev Input Sheet'!B6),\"\",'Dev Input Sheet'!B6)","v":""},null,null,"Mgmt.  Co.",{"$f":"IF(ISBLANK('Dev Input Sheet'!B16),\"\",'Dev Input Sheet'!B16)","v":""},null,null," CHFA Loan #:",null,{"$f":"IF(ISBLANK('Dev Input Sheet'!B10),\"\",'Dev Input Sheet'!B10)","v":""}]
["Owner:",null,{"$f":"IF(ISBLANK('Dev Input Sheet'!B14),\"\",'Dev Input Sheet'!B14)","v":""},null,null,"# of Units:",{"$f":"IF(ISBLANK('Dev Input Sheet'!B8),\"\",'Dev Input Sheet'!B8)","v":""},null,null,"CHFA Asset Manager:",null,{"$f":"IF(ISBLANK('Dev Input Sheet'!B12),\"\",'Dev Input Sheet'!B12)","v":""}]
["Project Contact Name:",null,{"$f":"IF(ISBLANK('Dev Input Sheet'!B18),\"\",'Dev Input Sheet'!B18)","v":""},null,null," Contact Email:",{"$f":"IF(ISBLANK('Dev Input Sheet'!B20),\"\",'Dev Input Sheet'!B20)","v":""},null,null,"Contact Phone:",null,{"$f":"IF(ISBLANK('Dev Input Sheet'!B22),\"\",'Dev Input Sheet'!B22)","v":""}]
[]
{"$rows_left_out":38}
{"sheet":"HM 6-24 Addl Sheet-3","index":9,"n_rows":43,"n_cols":17,"rows_kept":43,"cut":false,"hidden":true,"merged":[[42,0,42,5],[43,0,43,5],[36,11,36,14],[37,11,37,14],[38,11,38,14],[39,11,39,14],[40,6,40,8],[40,11,40,14],[35,11,35,14],[24,11,24,14],[25,11,25,14],[26,11,26,14],[27,11,27,14],[28,11,28,14],[29,11,29,14],[30,11,30,14],[31,11,31,14],[32,11,32,14],[33,11,33,14],[34,11,34,14],[23,11,23,14],[12,11,12,14],[13,11,13,14],[14,11,14,14],[15,11,15,14],[16,11,16,14],[17,11,17,14],[18,11,18,14],[19,11,19,14],[20,11,20,14],[21,11,21,14],[22,11,22,14],[11,11,11,14],[4,0,4,1],[4,2,4,3],[4,6,4,8],[4,9,4,10],[4,11,4,16],[5,0,5,1],[5,8,5,9],[5,10,5,14],[6,0,6,16],[7,11,7,14],[8,11,8,14],[9,11,9,14],[10,11,10,14],[2,0,2,1],[2,2,2,3],[2,6,2,8],[2,9,2,10],[2,11,2,16],[3,0,3,1],[3,2,3,3],[3,6,3,8],[3,9,3,10],[3,11,3,16]]}
["CONNECTICUT HOUSING FINANCE AUTHORITY",null,null,null,null,{"$f":"+'Form HM 6-24'!G1","v":"REQUEST TO RELEASE ESCROW FUNDS"},null,null,null,null,null,null,null,null,null,null,"CHFA Form HM 6-24-addl sheet(s)"]
[null,null,null,null,null,null,null,null,null,null,null,null,null,null,null,null," (Rev. 01/2019)"]
["Development Name:",null,{"$f":"IF(ISBLANK('Dev Input Sheet'!B6),\"\",'Dev Input Sheet'!B6)","v":""},null,null,"Mgmt.  Co.",{"$f":"IF(ISBLANK('Dev Input Sheet'!B16),\"\",'Dev Input Sheet'!B16)","v":""},null,null," CHFA Loan #:",null,{"$f":"IF(ISBLANK('Dev Input Sheet'!B10),\"\",'Dev Input Sheet'!B10)","v":""}]
["Owner:",null,{"$f":"IF(ISBLANK('Dev Input Sheet'!B14),\"\",'Dev Input Sheet'!B14)","v":""},null,null,"# of Units:",{"$f":"IF(ISBLANK('Dev Input Sheet'!B8),\"\",'Dev Input Sheet'!B8)","v":""},null,null,"CHFA Asset Manager:",null,{"$f":"IF(ISBLANK('Dev Input Sheet'!B12),\"\",'Dev Input Sheet'!B12)","v":""}]
["Project Contact Name:",null,{"$f":"IF(ISBLANK('Dev Input Sheet'!B18),\"\",'Dev Input Sheet'!B18)","v":""},null,null," Contact Email:",{"$f":"IF(ISBLANK('Dev Input Sheet'!B20),\"\",'Dev Input Sheet'!B20)","v":""},null,null,"Contact Phone:",null,{"$f":"IF(ISBLANK('Dev Input Sheet'!B22),\"\",'Dev Input Sheet'!B22)","v":""}]
[]
{"$rows_left_out":38}
{"sheet":"HM 6-24 Addl Sheet-4","index":10,"n_rows":43,"n_cols":17,"rows_kept":43,"cut":false,"hidden":true,"merged":[[42,0,42,5],[43,0,43,5],[36,11,36,14],[37,11,37,14],[38,11,38,14],[39,11,39,14],[40,6,40,8],[40,11,40,14],[35,11,35,14],[24,11,24,14],[25,11,25,14],[26,11,26,14],[27,11,27,14],[28,11,28,14],[29,11,29,14],[30,11,30,14],[31,11,31,14],[32,11,32,14],[33,11,33,14],[34,11,34,14],[23,11,23,14],[12,11,12,14],[13,11,13,14],[14,11,14,14],[15,11,15,14],[16,11,16,14],[17,11,17,14],[18,11,18,14],[19,11,19,14],[20,11,20,14],[21,11,21,14],[22,11,22,14],[11,11,11,14],[4,0,4,1],[4,2,4,3],[4,6,4,8],[4,9,4,10],[4,11,4,16],[5,0,5,1],[5,8,5,9],[5,10,5,14],[6,0,6,16],[7,11,7,14],[8,11,8,14],[9,11,9,14],[10,11,10,14],[2,0,2,1],[2,2,2,3],[2,6,2,8],[2,9,2,10],[2,11,2,16],[3,0,3,1],[3,2,3,3],[3,6,3,8],[3,9,3,10],[3,11,3,16]]}
["CONNECTICUT HOUSING FINANCE AUTHORITY",null,null,null,null,{"$f":"+'Form HM 6-24'!G1","v":"REQUEST TO RELEASE ESCROW FUNDS"},null,null,null,null,null,null,null,null,null,null,"CHFA Form HM 6-24-addl sheet(s)"]
[null,null,null,null,null,null,null,null,null,null,null,null,null,null,null,null," (Rev. 01/2019)"]
["Development Name:",null,{"$f":"IF(ISBLANK('Dev Input Sheet'!B6),\"\",'Dev Input Sheet'!B6)","v":""},null,null,"Mgmt.  Co.",{"$f":"IF(ISBLANK('Dev Input Sheet'!B16),\"\",'Dev Input Sheet'!B16)","v":""},null,null," CHFA Loan #:",null,{"$f":"IF(ISBLANK('Dev Input Sheet'!B10),\"\",'Dev Input Sheet'!B10)","v":""}]
["Owner:",null,{"$f":"IF(ISBLANK('Dev Input Sheet'!B14),\"\",'Dev Input Sheet'!B14)","v":""},null,null,"# of Units:",{"$f":"IF(ISBLANK('Dev Input Sheet'!B8),\"\",'Dev Input Sheet'!B8)","v":""},null,null,"CHFA Asset Manager:",null,{"$f":"IF(ISBLANK('Dev Input Sheet'!B12),\"\",'Dev Input Sheet'!B12)","v":""}]
["Project Contact Name:",null,{"$f":"IF(ISBLANK('Dev Input Sheet'!B18),\"\",'Dev Input Sheet'!B18)","v":""},null,null," Contact Email:",{"$f":"IF(ISBLANK('Dev Input Sheet'!B20),\"\",'Dev Input Sheet'!B20)","v":""},null,null,"Contact Phone:",null,{"$f":"IF(ISBLANK('Dev Input Sheet'!B22),\"\",'Dev Input Sheet'!B22)","v":""}]
[]
{"$rows_left_out":38}
{"sheet":"Release Apprvl HM 6-20","index":11,"n_rows":50,"n_cols":46,"rows_kept":50,"cut":false,"hidden":true,"merged":[[35,3,35,24],[4,1,4,45],[5,36,5,45],[6,36,6,45],[7,22,7,23],[8,22,8,23],[11,1,11,8],[11,9,11,26],[11,27,11,34],[11,35,11,45],[12,22,12,28],[13,1,13,8],[13,9,13,26],[13,27,13,34],[13,35,13,45],[14,22,14,28],[16,19,16,23],[16,30,16,37],[17,20,17,24],[24,7,24,11],[24,12,24,18],[24,23,24,29],[26,7,26,11],[26,12,26,18],[26,23,26,29],[32,1,32,45],[33,13,33,21],[33,35,33,43],[36,2,36,43],[37,10,37,31],[37,32,37,34],[37,35,37,43],[39,10,39,31],[39,32,39,34],[39,35,39,43],[46,35,46,43],[41,10,41,31],[41,32,41,34],[41,35,41,43],[43,10,43,31],[43,32,43,34],[43,35,43,43]]}
[null,"AUTHORIZATION TO",null,null,null,null,null,null,null,null,null,null,null,null,null,null,null,null,null,null,null,null,null,null,null,null,null,null,null,null,null,null,null,null,null,null,null,null,null,null,null,null,null,null,null,"Connecticut Housing Finance Authority"]
[null,"RELEASE ESCROW",null,null,null,null,null,null,null,null,null,null,null,null,null,null,null,null,null,null,null,null,null,null,null,null,null,null,null,null,null,null,null,null,null,null,null,null,null,null,null,null,null,null,null,"Asset Management - Multifamily Housing"]
[null,"CHFA Form HM 6-20 (Rev. 01/2019)"]
[]
[null,"This Authorization to Release Escrow satisfies Asset Management Policy relative to eligible items and supporting documentation.  Asset Management has reviewed this request and authorizes the release of the following amounts from one of the following:"]
[null,null,null,null,null,null,null,null,null,null,null,null,null,null,null,null,null,null,null,null,null,null,null,null,null,null,"Date Submitted to Finance:"]
{"$rows_left_out":45}
{"sheet":"Standards-Design","index":12,"n_rows":124,"n_cols":13,"rows_kept":124,"cut":false,"hidden":true,"merged":[[25,2,25,9],[26,2,26,9],[44,2,44,9],[0,0,0,9],[1,0,1,9],[3,0,3,9],[4,0,4,9],[5,2,5,9]]}
[]
["CHFA Capital Improvement Project Classifications for Repairs/Replacements/Installations"]
[]
["CHFA requires that repair/replacement work be completed in accordance with all applicable Building Codes, State and Federal regulations current CHFA Multifamily Design, Construction and Sustainability Standards (Standards).  Below is a list of example projects which require certification of completion in accordance with the Standards.  Examples are listed in three categories, and acceptable certifying agent(s) are indicated for each project.  Depending upon the project, the acceptable certifying agent(s) may include one or more of the following: the Owner [O], a CT-licensed/insured Building and/or Home Inspector, or HUD-approved Inspector [I], insured FHA 203K Compliance Consultant [C], Architect [A], Professional Engineer [PE], Licensed Environmental Consultant [LEC], or Approved Vendor [AV].  "]
["CHFA prefers the use of design professionals (A and PEs), whenever possible, to determine and develop the scope of work to be included in the bid documents, coordinate bids and certify that the work has been completed in accordance with CHFA's Standards.  CHFA reserves the right to require a design professional on any and all replacement/repair construction projects, subject to the scope and complexity of the proposed project.  "]
["Classification A.",null,"If the Owner will be completing any of the following Capital Improvement Repair/Replacement/Installation projects, the Owner may certify that the work has been completed in accordance with applicable building codes, State and Federal regulations, and CHFA's current Standards:"]
{"$rows_left_out":119}
{"sheet":"RR Codes HM 6-22","index":13,"n_rows":79,"n_cols":10,"rows_kept":79,"cut":false,"hidden":false,"merged":[[0,2,0,3],[9,1,9,3],[10,1,10,3],[11,1,11,3],[1,2,1,3],[4,0,4,3],[7,1,7,3],[8,1,8,3],[12,1,12,3],[13,1,13,3],[14,1,14,3],[15,1,15,3],[16,1,16,3],[17,1,17,3],[19,0,19,3],[20,1,20,3],[21,1,21,3],[22,1,22,3],[23,1,23,3],[25,0,25,3],[27,0,27,3],[28,1,28,3],[29,1,29,3],[30,1,30,3],[31,1,31,3],[32,1,32,3],[33,1,33,3],[34,1,34,3],[39,1,39,3],[35,1,35,3],[36,1,36,3],[37,1,37,3],[38,1,38,3]]}
["REPLACEMENT RESERVE                                                                                            ",null,"Connecticut Housing Finance Authority"]
["DESCRIPTIVE CODES",null,"Asset Management-Multifamily Housing"]
[]
["CHFA Form HM 6-22 (Rev. 05/2012)"]
["The following descriptions provide an outline of items eligible for reimbursement from the Reserve for Replacement Escrow as promulgated in the HUD Handbook 4350.1 Chapter 4 Section 9.  As a guideline, replacement expenditures are generally capitalized and may be eligible for reimbursement from a development’s Reserve for Replacement escrow to the extent available funds meet or exceed minimum requirements.  Purchases considered as routine maintenance are expensed and only occasionally may be eligible for reimbursement due to extraordinary conditions.  Items not specifically mentioned below may be allowed only with the Pre-Approval (HM 6-21) of the Asset Manager and HUD (as required)."]
[]
{"$rows_left_out":74}
{"sheet":"RR Codes HM 6-23","index":14,"n_rows":40,"n_cols":2,"rows_kept":40,"cut":false,"hidden":false,"merged":[[4,0,8,1]]}
["RESIDUAL RECEIPTS & GENERAL OPERATING             Connecticut Housing Finance Authority      "]
["DESCRIPTIVE CODES                                                                   Asset Management-Multifamily Housing "]
[]
["CHFA Form HM 6-23 (Rev. 07/2009)"]
["The following descriptions provide an outline of a number of conditions where draws from the Residual Receipt and/or General Operating Reserve Account may be deemed appropriate as promulgated in the HUD Handbook 4350.1 Chapters 25 and 26 .  Generally, releases are consistent with the Regulatory Agreement and the intent of the program under which the development was originally endorsed or approved. The request for withdrawal must be approved by HUD (as required).    "]
[]
{"$rows_left_out":34}